{"text_format":"1","workbook":"xlsx","n_sheets":5,"sheets":["Vandgennemstrømning","Søer","Biomassehøst","DMI","Rettelser"],"not_rendered":{"charts":0,"images":4,"macros":1,"external_links":0,"defined_names":26,"comments":2,"pivot_tables":0},"unopened":[],"bounds":{"document_bytes":16777216,"sheet_cells":100000,"rows_first":2000,"rows_last":500,"rows_between":2000,"halvings":0,"cell_chars":16384,"cell_head_chars":4096},"cells_cut":0,"cells_raw":0,"read":"whole","date_system":"1900"}

{"sheet":"Vandgennemstrømning","index":0,"n_rows":152,"n_cols":37,"rows_kept":152,"cut":false,"hidden":false,"merged":[[87,5,87,7],[7,10,7,13],[39,4,39,5],[39,6,39,8],[32,18,33,27],[39,20,39,22],[39,24,39,25],[68,7,68,12],[68,2,68,5],[38,11,38,13],[70,24,70,25],[40,20,40,22],[40,24,40,25],[41,4,41,5],[41,6,41,8],[41,11,41,12],[42,4,42,5],[42,6,42,8],[42,11,42,12],[42,20,42,22],[42,24,42,25],[41,20,41,22],[41,24,41,25],[44,20,44,22],[5,1,5,17],[38,6,38,8],[39,11,39,12],[40,4,40,5],[40,6,40,8],[40,11,40,12],[44,4,44,5],[44,6,44,8],[44,11,44,12],[44,24,44,25],[43,4,43,5],[43,6,43,8],[43,11,43,12],[43,20,43,22],[43,24,43,25],[46,4,46,5],[46,6,46,8],[46,11,46,12],[46,20,46,22],[46,24,46,25],[45,4,45,5],[45,6,45,8],[45,11,45,12],[45,20,45,22],[45,24,45,25],[48,4,48,5],[48,6,48,8],[48,11,48,12],[48,20,48,22],[48,24,48,25],[47,4,47,5],[47,6,47,8],[47,11,47,12],[47,20,47,22],[47,24,47,25],[50,4,50,5],[50,6,50,8],[50,11,50,12],[50,20,50,22],[50,24,50,25],[49,4,49,5],[49,6,49,8],[49,11,49,12],[49,20,49,22],[49,24,49,25],[52,4,52,5],[52,6,52,8],[52,11,52,12],[52,20,52,22],[52,24,52,25],[51,4,51,5],[51,6,51,8],[51,11,51,12],[51,20,51,22],[51,24,51,25],[54,4,54,5],[54,6,54,8],[54,11,54,12],[54,20,54,22],[54,24,54,25],[53,4,53,5],[53,6,53,8],[53,11,53,12],[53,20,53,22],[53,24,53,25],[56,4,56,5],[56,6,56,8],[56,11,56,12],[56,20,56,22],[56,24,56,25],[55,4,55,5],[55,6,55,8],[55,11,55,12],[55,20,55,22],[55,24,55,25],[58,4,58,5],[58,6,58,8],[58,11,58,12],[58,20,58,22],[58,24,58,25],[57,4,57,5],[57,6,57,8],[57,11,57,12],[57,20,57,22],[57,24,57,25],[60,4,60,5],[60,6,60,8],[60,11,60,12],[60,20,60,22],[60,24,60,25],[59,4,59,5],[59,6,59,8],[59,11,59,12],[59,20,59,22],[59,24,59,25],[62,4,62,5],[62,6,62,8],[62,11,62,12],[62,20,62,22],[62,24,62,25],[61,4,61,5],[61,6,61,8],[61,11,61,12],[61,20,61,22],[61,24,61,25],[64,4,64,5],[64,6,64,8],[64,11,64,12],[64,20,64,22],[64,24,64,25],[63,4,63,5],[63,6,63,8],[63,11,63,12],[63,20,63,22],[63,24,63,25],[66,4,66,5],[66,6,66,8],[66,11,66,12],[66,20,66,22],[66,24,66,25],[65,4,65,5],[65,6,65,8],[65,11,65,12],[65,20,65,22],[65,24,65,25]]}
[]
[",","Dette regneark er et støtteværktøj til \"Kvantificering af fosfortab fra vådområder og lavvandede søer\" version Januar 2023. De anvendte henvisninger til afnsit er til afsnit i denne vejledning."]
[]
[null,"Indsæt kun det antal rækker der skal bruges. Man kan senere indsætte  en tom række hvis det bliver nødvendigt"]
[]
[null,"Bestemmelse af vandstrømning gennem projektområdet (kapitel 3)"]
[null,null,"Projektnavn",null,null,null,"Glenstrup Enge"]
[null,null,"Data om projektområdet"]
[]
[null,null,"Projektområdets areal",null,null,null,39.5,"ha"]
[null,null,"Direkte oplandsareal til projektområde",null,null,null,58.1,"ha","Bestemmes via GIS procedure jf. afsnit 3.4 - figur 3.1"]
[null,null,"Projektområde + direkte oplandsareal",null,null,null,{"$f":"oplands_areal+areal","v":97.6},"ha"]
[null,null,"Vandløbsoplandets areal",null,null,null,23.2,"ha","Se figur 3.1"]
[]
[]
[]
[null,null,"Vandløbsoplandet:",null,null,null,null,null,null,null,null,"Det direkte opland:"]
[null,null,"Base flow index (BFI) og overfladenær strømning - Til brug ved oversvømmelse",null,null,null,null,null,null,null,null,"Base flow index (BFI) og overfladenær strømning fra dirékte opland"]
[null,null,"BFI regnes på baggrund af karakteristika for vandløbsoplandet (jf. afsnit 3.3)",null,null,null,null,null,null,null,null,"BFI regnes på baggrund af karakteristika for det direkte opland (jf. afsnit 3.3)"]
[]
{"$rows_left_out":133}
{"sheet":"Søer","index":1,"n_rows":208,"n_cols":6,"rows_kept":208,"cut":false,"hidden":false,"merged":[[4,1,4,2],[2,1,2,2],[3,1,3,2],[5,1,5,2]]}
[null,"Søer",null,null,null,"Vejledning til indtastning I dette faneblad"]
[]
[null,"Opholdstid (tw, dage)",null,null,null,"Først indtastes søens opholdstid i dage"]
[null,"Søareal [ha]",null,null,null,"Dernæst det samlede søareal"]
[null,"Sum af søareal i prøvefelter [ha]",null,{"$f":"SUM(C9:C209)","v":0},null,"Hvis cellen bliver rød  er der forskel på indtastet søareal i celle D4 og summen af prøvefelterne"]
[null,"Arealvægtet Fe:P-forhold",null,{"$f":"SUMPRODUCT(C9:C209,D9:D209)/SUM(C9:C209)","v":{"$error":"#DIV/0!"}},null,"Herefter  indtastes de prøvefelter hvori der vil være sø"]
[null,null,null,null,null,"Da det IKKE nødvendigvis er hele prøvefeltet der bliver til sø indtastes  arealet af den del af prøvefeltet der bliver til sø  "]
[null,"Prøvefelt","Søareal [ha]","Fe:P",null,"Hvis sø indgår i projektet fremgår beregningerne af kolonne AK i fanebladet \"Vandgennemstrømning\" og det totale tab fra søen kan ses i celle X90"]
[null,null,null,{"$f":"IF(ISERROR(VLOOKUP(B9,Vandgennemstrømning!$T$41:$AH$265,15,FALSE)),\"\",VLOOKUP(B9,Vandgennemstrømning!$T$41:$AH$265,15,FALSE))","v":""}]
[null,null,null,{"$f":"IF(ISERROR(VLOOKUP(B10,Vandgennemstrømning!$T$41:$AH$265,15,FALSE)),\"\",VLOOKUP(B10,Vandgennemstrømning!$T$41:$AH$265,15,FALSE))","v":""}]
[null,null,null,{"$f":"IF(ISERROR(VLOOKUP(B11,Vandgennemstrømning!$T$41:$AH$265,15,FALSE)),\"\",VLOOKUP(B11,Vandgennemstrømning!$T$41:$AH$265,15,FALSE))","v":""}]
[null,null,null,{"$f":"IF(ISERROR(VLOOKUP(B12,Vandgennemstrømning!$T$41:$AH$265,15,FALSE)),\"\",VLOOKUP(B12,Vandgennemstrømning!$T$41:$AH$265,15,FALSE))","v":""}]
[null,null,null,{"$f":"IF(ISERROR(VLOOKUP(B13,Vandgennemstrømning!$T$41:$AH$265,15,FALSE)),\"\",VLOOKUP(B13,Vandgennemstrømning!$T$41:$AH$265,15,FALSE))","v":""}]
[null,null,null,{"$f":"IF(ISERROR(VLOOKUP(B14,Vandgennemstrømning!$T$41:$AH$265,15,FALSE)),\"\",VLOOKUP(B14,Vandgennemstrømning!$T$41:$AH$265,15,FALSE))","v":""}]
[null,null,null,{"$f":"IF(ISERROR(VLOOKUP(B15,Vandgennemstrømning!$T$41:$AH$265,15,FALSE)),\"\",VLOOKUP(B15,Vandgennemstrømning!$T$41:$AH$265,15,FALSE))","v":""}]
[null,null,null,{"$f":"IF(ISERROR(VLOOKUP(B16,Vandgennemstrømning!$T$41:$AH$265,15,FALSE)),\"\",VLOOKUP(B16,Vandgennemstrømning!$T$41:$AH$265,15,FALSE))","v":""}]
[null,null,null,{"$f":"IF(ISERROR(VLOOKUP(B17,Vandgennemstrømning!$T$41:$AH$265,15,FALSE)),\"\",VLOOKUP(B17,Vandgennemstrømning!$T$41:$AH$265,15,FALSE))","v":""}]
[null,null,null,{"$f":"IF(ISERROR(VLOOKUP(B18,Vandgennemstrømning!$T$41:$AH$265,15,FALSE)),\"\",VLOOKUP(B18,Vandgennemstrømning!$T$41:$AH$265,15,FALSE))","v":""}]
[null,null,null,{"$f":"IF(ISERROR(VLOOKUP(B19,Vandgennemstrømning!$T$41:$AH$265,15,FALSE)),\"\",VLOOKUP(B19,Vandgennemstrømning!$T$41:$AH$265,15,FALSE))","v":""}]
[null,null,null,{"$f":"IF(ISERROR(VLOOKUP(B20,Vandgennemstrømning!$T$41:$AH$265,15,FALSE)),\"\",VLOOKUP(B20,Vandgennemstrømning!$T$41:$AH$265,15,FALSE))","v":""}]
{"$rows_left_out":189}
{"sheet":"Biomassehøst","index":2,"n_rows":206,"n_cols":4,"rows_kept":206,"cut":false,"hidden":false,"merged":[[2,1,2,2]]}
[null,"Biomassehøst"]
[]
[null,"Antal år med afhøstning (0-10)"]
[]
[null,"Prøvefelt","Areal (ha)","Reduktion i PBD-pulje (kg)"]
[null,null,null,{"$f":"IF(OR(C6=\"\",$D$3=\"\"),\"\",$D$3*3*C6)","v":""}]
[null,null,null,{"$f":"IF(OR(C7=\"\",$D$3=\"\"),\"\",$D$3*3*C7)","v":""}]
[null,null,null,""]
[null,null,null,""]
[null,null,null,""]
[null,null,null,""]
[null,null,null,""]
[null,null,null,""]
[null,null,null,""]
[null,null,null,""]
[null,null,null,""]
[null,null,null,""]
[null,null,null,""]
[null,null,null,""]
[null,null,null,""]
{"$rows_left_out":187}
{"sheet":"DMI","index":3,"n_rows":610,"n_cols":34,"rows_kept":610,"cut":false,"hidden":false,"merged":[]}
["DMI10_NY","DMI10","nedbor_kor","sand_pct","dyrk_pct","Georegion","befast_pct","clay_pct","potfordampning","S_PPmodel","EM_Ppmodel","A_PPmodel"]
["627_44",10001,968.12000000000023,73.981988492890324,41.470236096350263,1,11.91400397375444,3.9288288661199999,614.87000000000069,0,4.674830364401104,40.918374131841986]
["626_44",10002,1023.7300000000001,26.184985141889804,74.763682482293362,1,6.209108767188587,10.8950264354,614.87000000000069,53.277099247715753,4.0670274379247147,73.314215111500232,"kol","list","list_DMI","nedbor_kor","potfordampning","ler_pct","sand_pct","befæst_pct","georeg","S_PPmodel","EM_Ppmodel","A_PPmodel",null,"kol","list","list_DMI","nedbor_kor","potfordampning","ler_pct","befæst_pct","georeg"]
["625_44",10003,1029.3400000000004,72.119346416775528,74.643645845433937,3,4.5822028829323367,7.2890640280999994,615.05000000000086,2.6511029034141269,6.1798693748397815,66.99969236082292,"C",{"$f":"Vandgennemstrømning!$C$22","v":"627_55"},{"$f":"IF(COUNTIF($B$2:$B$610,N4),N4,VLOOKUP(N4,$A$2:$B$610,2,FALSE))","v":10278},{"$f":"VLOOKUP($O4,$B$2:$C$610,2,FALSE)","v":845.29000000000053},{"$f":"VLOOKUP($O4,$B$2:$I$610,8,FALSE)","v":593.67000000000098},{"$f":"VLOOKUP($O4,$B$2:$H$610,7,FALSE)","v":5.2071859089199997},{"$f":"VLOOKUP($O4,$B$2:$D$610,3,FALSE)","v":92.325064147075508},{"$f":"VLOOKUP($O4,$B$2:$G$610,6,FALSE)","v":8.214394491109493},{"$f":"VLOOKUP($O4,$B$2:$F$610,5,FALSE)","v":4},{"$f":"VLOOKUP($O4,$B$2:$K$610,9,FALSE)","v":28.104566475359583},{"$f":"VLOOKUP($O4,$B$2:$L$610,10,FALSE)","v":4.9078530842061312},{"$f":"VLOOKUP($O4,$B$2:$L$610,11,FALSE)","v":63.8164359043096},null,"L",{"$f":"Vandgennemstrømning!L22","v":"627_55"},{"$f":"IF(COUNTIF($B$2:$B$610,AA4),AA4,VLOOKUP(AA4,$A$2:$B$610,2,FALSE))","v":10278},{"$f":"VLOOKUP($AB4,$B$2:$C$610,2,FALSE)","v":845.29000000000053},{"$f":"VLOOKUP($AB4,$B$2:$I$610,8,FALSE)","v":593.67000000000098},{"$f":"VLOOKUP($AB4,$B$2:$H$610,7,FALSE)","v":5.2071859089199997},{"$f":"VLOOKUP($AB4,$B$2:$G$610,6,FALSE)","v":8.214394491109493},{"$f":"VLOOKUP($AB4,$B$2:$F$610,5,FALSE)","v":4}]
["624_44",10004,1018.3700000000002,92.317194427605074,40.247638474291463,3,14.242332402418866,3.7915594617099999,615.05000000000086,0,13.180241654721462,30.387095673417953,"D",{"$f":"Vandgennemstrømning!$D$22","v":0},{"$f":"IF(COUNTIF($B$2:$B$610,N5),N5,VLOOKUP(N5,$A$2:$B$610,2,FALSE))","v":{"$error":"#N/A"}},{"$f":"VLOOKUP($O5,$B$2:$C$610,2,FALSE)","v":{"$error":"#N/A"}},{"$f":"VLOOKUP($O5,$B$2:$I$610,8,FALSE)","v":{"$error":"#N/A"}},{"$f":"VLOOKUP($O5,$B$2:$H$610,7,FALSE)","v":{"$error":"#N/A"}},{"$f":"VLOOKUP($O5,$B$2:$D$610,3,FALSE)","v":{"$error":"#N/A"}},{"$f":"VLOOKUP($O5,$B$2:$G$610,6,FALSE)","v":{"$error":"#N/A"}},{"$f":"VLOOKUP($O5,$B$2:$F$610,5,FALSE)","v":{"$error":"#N/A"}},{"$f":"VLOOKUP($O5,$B$2:$K$610,9,FALSE)","v":{"$error":"#N/A"}},{"$f":"VLOOKUP($O5,$B$2:$L$610,10,FALSE)","v":{"$error":"#N/A"}},{"$f":"VLOOKUP($O5,$B$2:$L$610,11,FALSE)","v":{"$error":"#N/A"}},null,"M",{"$f":"Vandgennemstrømning!M22","v":0},{"$f":"IF(COUNTIF($B$2:$B$610,AA5),AA5,VLOOKUP(AA5,$A$2:$B$610,2,FALSE))","v":{"$error":"#N/A"}},{"$f":"VLOOKUP($AB5,$B$2:$C$610,2,FALSE)","v":{"$error":"#N/A"}},{"$f":"VLOOKUP($AB5,$B$2:$I$610,8,FALSE)","v":{"$error":"#N/A"}},{"$f":"VLOOKUP($AB5,$B$2:$H$610,7,FALSE)","v":{"$error":"#N/A"}},{"$f":"VLOOKUP($AB5,$B$2:$G$610,6,FALSE)","v":{"$error":"#N/A"}},{"$f":"VLOOKUP($AB5,$B$2:$F$610,5,FALSE)","v":{"$error":"#N/A"}}]
["623_44",10005,1012.8599999999999,84.555150982123138,44.141627340127286,3,14.244461664899145,4.6181744629399999,620.17000000000064,0.9182241080581256,2.0100004077389455,39.002905551704139,"E",{"$f":"Vandgennemstrømning!$E$22","v":0},{"$error":"#N/A"},{"$error":"#N/A"},{"$error":"#N/A"},{"$error":"#N/A"},{"$error":"#N/A"},{"$error":"#N/A"},{"$error":"#N/A"},{"$error":"#N/A"},{"$error":"#N/A"},{"$error":"#N/A"},null,"N",{"$f":"Vandgennemstrømning!N22","v":0},{"$error":"#N/A"},{"$error":"#N/A"},{"$error":"#N/A"},{"$error":"#N/A"},{"$error":"#N/A"},{"$error":"#N/A"}]
["622_44",10006,1014.4400000000002,68.785050074385282,50.942564618146321,3,8.4863689501024844,6.9525450422099997,620.17000000000064,10.75944763653388,8.0044663930360773,50.490021219894956,"F",{"$f":"Vandgennemstrømning!$F$22","v":0},{"$error":"#N/A"},{"$error":"#N/A"},{"$error":"#N/A"},{"$error":"#N/A"},{"$error":"#N/A"},{"$error":"#N/A"},{"$error":"#N/A"},{"$error":"#N/A"},{"$error":"#N/A"},{"$error":"#N/A"},null,"L",{"$f":"Vandgennemstrømning!L23","v":0},{"$error":"#N/A"},{"$error":"#N/A"},{"$error":"#N/A"},{"$error":"#N/A"},{"$error":"#N/A"},{"$error":"#N/A"}]
["621_44",10007,1003.3800000000003,86.340611286341471,34.299111985910933,3,12.873687381447787,4.5938351217499998,628.91000000000054,9.3990999060063274,6.4736836585190956,35.486022462941591,"G",{"$f":"Vandgennemstrømning!$G$22","v":0},{"$error":"#N/A"},{"$error":"#N/A"},{"$error":"#N/A"},{"$error":"#N/A"},{"$error":"#N/A"},{"$error":"#N/A"},{"$error":"#N/A"},{"$error":"#N/A"},{"$error":"#N/A"},{"$error":"#N/A"},null,"M",{"$f":"Vandgennemstrømning!M23","v":0},{"$error":"#N/A"},{"$error":"#N/A"},{"$error":"#N/A"},{"$error":"#N/A"},{"$error":"#N/A"},{"$error":"#N/A"}]
["620_44",10008,1003.3100000000002,98.585015627640814,13.158442634575975,3,24.541617918493159,2.6419006940699998,628.91000000000054,0,3.7555304120741746,11.120143383483523,"H",{"$f":"Vandgennemstrømning!$H$22","v":0},{"$error":"#N/A"},{"$error":"#N/A"},{"$error":"#N/A"},{"$error":"#N/A"},{"$error":"#N/A"},{"$error":"#N/A"},{"$error":"#N/A"},{"$error":"#N/A"},{"$error":"#N/A"},{"$error":"#N/A"},null,"N",{"$f":"Vandgennemstrømning!N23","v":0},{"$error":"#N/A"},{"$error":"#N/A"},{"$error":"#N/A"},{"$error":"#N/A"},{"$error":"#N/A"},{"$error":"#N/A"}]
["619_44",10009,1011.7900000000002,97.409273321994505,15.333850534525567,3,8.8116834298732201,3.7922438442799997,626.83000000000061,1.5052829072908276,12.819208241396582,10.953372245445726,"I",{"$f":"Vandgennemstrømning!$I$22","v":0},{"$error":"#N/A"},{"$error":"#N/A"},{"$error":"#N/A"},{"$error":"#N/A"},{"$error":"#N/A"},{"$error":"#N/A"},{"$error":"#N/A"},{"$error":"#N/A"},{"$error":"#N/A"},{"$error":"#N/A"},null,"L",{"$f":"Vandgennemstrømning!L24","v":0},{"$error":"#N/A"},{"$error":"#N/A"},{"$error":"#N/A"},{"$error":"#N/A"},{"$error":"#N/A"},{"$error":"#N/A"}]
["618_44",10010,1033.9300000000003,98.603503585899873,7.2556507605350928,3,5.0847330075627779,3.0247049537499997,626.83000000000061,1.518746076010735,19.324698000293697,3.9467339031008373,"J",{"$f":"Vandgennemstrømning!$J$22","v":0},{"$error":"#N/A"},{"$error":"#N/A"},{"$error":"#N/A"},{"$error":"#N/A"},{"$error":"#N/A"},{"$error":"#N/A"},{"$error":"#N/A"},{"$error":"#N/A"},{"$error":"#N/A"},{"$error":"#N/A"},null,"M",{"$f":"Vandgennemstrømning!M23","v":0},{"$error":"#N/A"},{"$error":"#N/A"},{"$error":"#N/A"},{"$error":"#N/A"},{"$error":"#N/A"},{"$error":"#N/A"}]
["617_44",10011,1052.6800000000003,98.303516709250957,4.5649674133075173,3,4.6550260321896824,3.0014865026499997,626.26000000000067,0,18.279743150247469,2.6458680720188008,"C",{"$f":"Vandgennemstrømning!$C$23","v":0},{"$error":"#N/A"},{"$error":"#N/A"},{"$error":"#N/A"},{"$error":"#N/A"},{"$error":"#N/A"},{"$error":"#N/A"},{"$error":"#N/A"},{"$error":"#N/A"},{"$error":"#N/A"},{"$error":"#N/A"},null,"N",{"$f":"Vandgennemstrømning!N23","v":0},{"$error":"#N/A"},{"$error":"#N/A"},{"$error":"#N/A"},{"$error":"#N/A"},{"$error":"#N/A"},{"$error":"#N/A"}]
["616_44",10012,1038.3200000000004,98.970594123575864,4.7053015390618178,3,5.6672144344136992,1.5420911607899999,626.26000000000067,0,10.10354600561563,1.1958197797906602,"D",{"$f":"Vandgennemstrømning!$D$23","v":0},{"$error":"#N/A"},{"$error":"#N/A"},{"$error":"#N/A"},{"$error":"#N/A"},{"$error":"#N/A"},{"$error":"#N/A"},{"$error":"#N/A"},{"$error":"#N/A"},{"$error":"#N/A"},{"$error":"#N/A"}]
["615_44",10013,1046.53,92.865752743472257,4.6096098103850398,3,10.493034325432312,2.6858414598299998,641.26000000000079,0,9.9953345031196346,1.9476724494661208,"E",{"$f":"Vandgennemstrømning!$E$23","v":0},{"$error":"#N/A"},{"$error":"#N/A"},{"$error":"#N/A"},{"$error":"#N/A"},{"$error":"#N/A"},{"$error":"#N/A"},{"$error":"#N/A"},{"$error":"#N/A"},{"$error":"#N/A"},{"$error":"#N/A"},null,null,"average",null,{"$f":"AVERAGE(IF(ISERROR(AC4:AC12),\"\",AC4:AC12))","v":845.29000000000053},{"$f":"AVERAGE(IF(ISERROR(AD4:AD12),\"\",AD4:AD12))","v":593.67000000000098},{"$f":"AVERAGE(IF(ISERROR(AE4:AE12),\"\",AE4:AE12))","v":5.2071859089199997},{"$f":"AVERAGE(IF(ISERROR(AF4:AF12),\"\",AF4:AF12))","v":8.214394491109493},{"$f":"IFERROR(MODE(IF(ISERROR(AG4:AG12),\"\",AG4:AG12)),INDEX(AG4:AG12,MATCH(TRUE,ISNUMBER(AG4:AG12),0)))","v":4},"hvis der kun er 2 DMI grids med hver sin georegion, vælges den første på listen"]
["631_45",10014,1016.7400000000004,99.692964550530405,0,1,0,1.5924050596699999,607.3500000000007,0,0,0,"F",{"$f":"Vandgennemstrømning!$F$23","v":0},{"$error":"#N/A"},{"$error":"#N/A"},{"$error":"#N/A"},{"$error":"#N/A"},{"$error":"#N/A"},{"$error":"#N/A"},{"$error":"#N/A"},{"$error":"#N/A"},{"$error":"#N/A"},{"$error":"#N/A"}]
["630_45",10015,987.1500000000002,98.011979505765922,7.9752638666745368E-2,1,2.649231159572401,1.6542131248999998,607.3500000000007,0,9.1471467486325402,0.13583993613378831,"G",{"$f":"Vandgennemstrømning!$G$23","v":0},{"$error":"#N/A"},{"$error":"#N/A"},{"$error":"#N/A"},{"$error":"#N/A"},{"$error":"#N/A"},{"$error":"#N/A"},{"$error":"#N/A"},{"$error":"#N/A"},{"$error":"#N/A"},{"$error":"#N/A"}]
["629_45",10016,950.55000000000018,73.050955438751529,40.134487529793056,1,7.4211024360610622,5.2325972195499997,610.41000000000076,39.075558821878879,8.0481453509058394,36.370106326047747,"H",{"$f":"Vandgennemstrømning!$H$23","v":0},{"$error":"#N/A"},{"$error":"#N/A"},{"$error":"#N/A"},{"$error":"#N/A"},{"$error":"#N/A"},{"$error":"#N/A"},{"$error":"#N/A"},{"$error":"#N/A"},{"$error":"#N/A"},{"$error":"#N/A"}]
["628_45",10017,928.85000000000036,41.114338493395593,40.662172836454708,1,11.208161416423739,7.6429707201599992,610.41000000000076,35.315400638115065,22.07769534814819,35.913219632451501,"I",{"$f":"Vandgennemstrømning!$I$23","v":0},{"$error":"#N/A"},{"$error":"#N/A"},{"$error":"#N/A"},{"$error":"#N/A"},{"$error":"#N/A"},{"$error":"#N/A"},{"$error":"#N/A"},{"$error":"#N/A"},{"$error":"#N/A"},{"$error":"#N/A"}]
["627_45",10018,967.10000000000014,35.107529806779539,64.723944276086868,1,8.974705845233494,7.8260188175499996,614.87000000000069,3.4090375455809325,7.6268184272383017,66.084040677591076,"J",{"$f":"Vandgennemstrømning!$J$23","v":0},{"$error":"#N/A"},{"$error":"#N/A"},{"$error":"#N/A"},{"$error":"#N/A"},{"$error":"#N/A"},{"$error":"#N/A"},{"$error":"#N/A"},{"$error":"#N/A"},{"$error":"#N/A"},{"$error":"#N/A"}]
["626_45",10019,1010.3000000000005,30.43326177037833,70.514773604026487,1,11.481847430535828,10.302721522500001,614.87000000000069,2.6204551387000632,1.5207144943815749,71.487692052462052,"C",{"$f":"Vandgennemstrømning!$C$24","v":0},{"$error":"#N/A"},{"$error":"#N/A"},{"$error":"#N/A"},{"$error":"#N/A"},{"$error":"#N/A"},{"$error":"#N/A"},{"$error":"#N/A"},{"$error":"#N/A"},{"$error":"#N/A"},{"$error":"#N/A"}]
{"$rows_left_out":591}
{"sheet":"Rettelser","index":4,"n_rows":19,"n_cols":2,"rows_kept":19,"cut":false,"hidden":false,"merged":[]}
["Rettelser foretaget i regne arket"]
[]
["Juni2018: indsat ny opdateret figur vandløbsoplande"]
["Juni 2018: Indsat 2 Gule Bjælker i række 31 E-I og L-O fortællende hvilke data der skal indtastes"]
["Juni 2018: Der kan nu indsættes en ekstra række i regnearket, se kolonne R nedenunder gennemstrømning"]
[]
["Oktober 2018","Ligning 6.1 rettet"]
[]
["August 2020","Indsat ligning for oxisk interface, M2, i kolonne AI"]
[null,"Fosforfrigivelse beregnet efter M2 i kolonne AJ"]
[null,"Antal år med fosforfrigivelse med oprindelig formel M1 beregnes for hvert grid i kolonne AK"]
[null,"Antal år med fosforfrigivelse beregnet med ny formel M2 beregnes for hvert grid i kolonne AL"]
["Efterår 2022","Opdateret formler for BFI beregning kapitel 3.3 I vejledningen"]
["Efterår 2022","Opdateret BOKS 1 i kapitel 5.3 hvor PP beregnes. NY opdatert for BFI anvendes"]
["Efterår 2022","Formel for P tab med oxisk interface opdateret. Vejledningen kapitel 6.2"]
["Efterår 2022","Ny formel for  P tab for søer indsat og nyt faneblad \"Søer\" inkluderet i regnearket"]
["Efterår 2022","Høst af biomasse før retablering af vådområde eller sø inkluderet i regnearket. Fanebladet \"Biomassehøst\" indsat"]
["Efterår 2022","Nyt faneblad \"DMI\" indsat. Ved indtastning af DMI gridnummer/gridnumre hentes nedbør, fordampning, ler_pct, sand_pct, dyrk_pct, befast_pct, georegion, automatisk ind"]
["Efterår 2022","BEMÆRK at Ler_procent og befæstet areal i procent kan indtastet i celle M28 og M29 hvis disse værdier afviger fra DMI griddets værdier"]